Reaction Details
TargetD(2) dopamine receptor
LigandBDBM50387559
Substrate/Competitorn/a
Meas. Tech.ChEMBL_830333 (CHEMBL2060922)
Ki 346.76±n/a nM
Citation Qian, WLu, WSun, HLi, ZZhu, LZhao, RZhang, LZhou, SZhou, YJiang, HZhen, XLiu, H Design, synthesis, and pharmacological evaluation of novel tetrahydroprotoberberine derivatives: selective inhibitors of dopamine D1 receptor. Bioorg Med Chem20:4862-71 (2012) 
 
D(2) dopamine receptor
Name:D(2) dopamine receptor
Type:Cell-surface receptors
Mol. Mass.:50647.10
Organism:Homo sapiens (Human)
Description:P14416
Residue:443
BDBM50387559
NameBDBM50387559
Synonyms:CHEMBL2057453
TypeSmall organic molecule
Emp. Form.C19H21NO3
Mol. Mass.311.3749
SMILESCOc1ccc2CN3CCc4cc(OC)c(O)cc4[C@@H]3Cc2c1