Reaction Details
TargetD(1A) dopamine receptor
LigandBDBM50387557
Substrate/Competitorn/a
Meas. Tech.ChEMBL_830331 (CHEMBL2060920)
IC50 56.37±n/a nM
Citation Qian, WLu, WSun, HLi, ZZhu, LZhao, RZhang, LZhou, SZhou, YJiang, HZhen, XLiu, H Design, synthesis, and pharmacological evaluation of novel tetrahydroprotoberberine derivatives: selective inhibitors of dopamine D1 receptor. Bioorg Med Chem20:4862-71 (2012) 
 
D(1A) dopamine receptor
Name:D(1A) dopamine receptor
Type:Enzyme
Mol. Mass.:49303.43
Organism:Homo sapiens (Human)
Description:P21728
Residue:446
BDBM50387557
NameBDBM50387557
Synonyms:CHEMBL2057457 | US9359372, DC037031
TypeSmall organic molecule
Emp. Form.C20H23NO2
Mol. Mass.309.4021
SMILESCOc1cc2CCN3Cc4c(C)cc(C)cc4C[C@H]3c2cc1O