Reaction Details
TargetD(1A) dopamine receptor
LigandBDBM50387558
Substrate/Competitorn/a
Meas. Tech.ChEMBL_830331 (CHEMBL2060920)
Ki 17.29±n/a nM
Citation Qian, WLu, WSun, HLi, ZZhu, LZhao, RZhang, LZhou, SZhou, YJiang, HZhen, XLiu, H Design, synthesis, and pharmacological evaluation of novel tetrahydroprotoberberine derivatives: selective inhibitors of dopamine D1 receptor. Bioorg Med Chem20:4862-71 (2012) 
 
D(1A) dopamine receptor
Name:D(1A) dopamine receptor
Type:Enzyme
Mol. Mass.:49303.43
Organism:Homo sapiens (Human)
Description:P21728
Residue:446
BDBM50387558
NameBDBM50387558
Synonyms:CHEMBL2057456
TypeSmall organic molecule
Emp. Form.C21H25NO5
Mol. Mass.371.4269
SMILESCOc1cc2CCN3Cc4c(OC)cc(OC)c(CO)c4C[C@H]3c2cc1O