Reaction Details
TargetD(1A) dopamine receptor
LigandBDBM50387564
Substrate/Competitorn/a
Meas. Tech.ChEMBL_830331 (CHEMBL2060920)
Ki 7.97±n/a nM
Citation Qian, WLu, WSun, HLi, ZZhu, LZhao, RZhang, LZhou, SZhou, YJiang, HZhen, XLiu, H Design, synthesis, and pharmacological evaluation of novel tetrahydroprotoberberine derivatives: selective inhibitors of dopamine D1 receptor. Bioorg Med Chem20:4862-71 (2012) 
 
D(1A) dopamine receptor
Name:D(1A) dopamine receptor
Type:Enzyme
Mol. Mass.:49303.43
Organism:Homo sapiens (Human)
Description:P21728
Residue:446
BDBM50387564
NameBDBM50387564
Synonyms:CHEMBL2057445
TypeSmall organic molecule
Emp. Form.C21H25NO4
Mol. Mass.355.4275
SMILESCOc1cc2CCN3Cc4c(C[C@H]3c2c(OC)c1)cc(OC)cc4OC