Reaction Details
TargetD(1A) dopamine receptor
LigandBDBM50387556
Substrate/Competitorn/a
Meas. Tech.ChEMBL_830331 (CHEMBL2060920)
Ki 182.41±n/a nM
Citation Qian, WLu, WSun, HLi, ZZhu, LZhao, RZhang, LZhou, SZhou, YJiang, HZhen, XLiu, H Design, synthesis, and pharmacological evaluation of novel tetrahydroprotoberberine derivatives: selective inhibitors of dopamine D1 receptor. Bioorg Med Chem20:4862-71 (2012) 
 
D(1A) dopamine receptor
Name:D(1A) dopamine receptor
Type:Enzyme
Mol. Mass.:49303.43
Organism:Homo sapiens (Human)
Description:P21728
Residue:446
BDBM50387556
NameBDBM50387556
Synonyms:CHEMBL2057438 | US9359372, DC037077
TypeSmall organic molecule
Emp. Form.C21H23NO5
Mol. Mass.369.411
SMILESCOc1cc(OC)c2CN3CCc4cc5OCOc5cc4[C@@H]3Cc2c1CO