Reaction Details
Target4,4'-diapophytoene synthase
LigandBDBM50388397
Substrate/Competitorn/a
Meas. Tech.ChEMBL_829914 (CHEMBL2061562)
Ki 1500±n/a nM
Citation Lin, FYLiu, YLLi, KCao, RZhu, WAxelson, JPang, ROldfield, E Head-to-head prenyl tranferases: anti-infective drug targets. J Med Chem55:4367-72 (2012) 
 
4,4'-diapophytoene synthase
Name:4,4'-diapophytoene synthase
Type:PROTEIN
Mol. Mass.:34309.10
Organism:Staphylococcus aureus
Description:ChEMBL_1352846
Residue:287
BDBM50388397
NameBDBM50388397
Synonyms:CHEMBL39581
TypeSmall organic molecule
Emp. Form.C15H13NO2S
Mol. Mass.271.334
SMILESN#CSCCOc1ccc(Oc2ccccc2)cc1