Reaction Details
Target4,4'-diapophytoene synthase
LigandBDBM50388398
Substrate/Competitorn/a
Meas. Tech.ChEMBL_829914 (CHEMBL2061562)
Ki 360±n/a nM
Citation Lin, FYLiu, YLLi, KCao, RZhu, WAxelson, JPang, ROldfield, E Head-to-head prenyl tranferases: anti-infective drug targets. J Med Chem55:4367-72 (2012) 
 
4,4'-diapophytoene synthase
Name:4,4'-diapophytoene synthase
Type:PROTEIN
Mol. Mass.:34309.10
Organism:Staphylococcus aureus
Description:ChEMBL_1352846
Residue:287
BDBM50388398
NameBDBM50388398
Synonyms:CHEMBL561057 | SQ-109
TypeSmall organic molecule
Emp. Form.C22H38N2
Mol. Mass.330.5505
SMILESCC(C)=CCC\C(C)=C\CNCCNC1C2CC3CC(C2)CC1C3