Reaction Details
TargetTranslocator protein
LigandBDBM50388423
Substrate/Competitorn/a
Meas. Tech.ChEMBL_829916 (CHEMBL2061564)
Ki 2.2±n/a nM
Citation Castellano, STaliani, SMilite, CPugliesi, IDa Pozzo, ERizzetto, EBendinelli, SCosta, BCosconati, SGreco, GNovellino, ESbardella, GStefancich, GMartini, CDa Settimo, F Synthesis and biological evaluation of 4-phenylquinazoline-2-carboxamides designed as a novel class of potent ligands of the translocator protein. J Med Chem55:4506-10 (2012) 
 
Translocator protein
Name:Translocator protein
Type:Mitochondrion membrane protein
Mol. Mass.:18945.84
Organism:Rattus norvegicus (rat)
Description:Competitive binding experiments were performed on rat kidney mitochondrial membranes.
Residue:169
BDBM50388423
NameBDBM50388423
Synonyms:CHEMBL2059061
TypeSmall organic molecule
Emp. Form.C20H20ClN3O
Mol. Mass.353.845
SMILESCC[C@H](C)N(C)C(=O)c1nc(-c2ccccc2Cl)c2ccccc2n1