Reaction Details
TargetCytochrome P450 2D6
LigandBDBM50388532
Substrate/Competitorn/a
Meas. Tech.ChEMBL_830279 (CHEMBL2060830)
IC50>6000±n/a nM
Citation Nagle, AWu, TKuhen, KGagaring, KBorboa, RFrancek, CChen, ZPlouffe, DLin, XCaldwell, CEk, JSkolnik, SLiu, FWang, JChang, JLi, CLiu, BHollenbeck, TTuntland, TIsbell, JChuan, TAlper, PBFischli, CBrun, RLakshminarayana, SBRottmann, MDiagana, TTWinzeler, EAGlynne, RTully, DCChatterjee, AK Imidazolopiperazines: lead optimization of the second-generation antimalarial agents. J Med Chem55:4244-73 (2012) 
 
Cytochrome P450 2D6
Name:Cytochrome P450 2D6
Type:Protein
Mol. Mass.:55774.82
Organism:Homo sapiens (Human)
Description:P10635
Residue:497
BDBM50388532
NameBDBM50388532
Synonyms:CHEMBL2058833
TypeSmall organic molecule
Emp. Form.C22H23F2N5O
Mol. Mass.411.4477
SMILESCC1(C)N(CCn2c(Nc3ccc(F)cc3)c(nc12)-c1ccc(F)cc1)C(=O)CN