Reaction Details
TargetHomeodomain-interacting protein kinase 2
LigandBDBM50388781
Substrate/Competitorn/a
Meas. Tech.ChEMBL_830911 (CHEMBL2065460)
IC50 570±n/a nM
Citation Dowling, JEChuaqui, CPontz, TWLyne, PDLarsen, NABlock, MHChen, HSu, NWu, ARussell, DPollard, HLee, JWPeng, BThakur, KYe, QZhang, TBrassil, PRacicot, VBao, LDenz, CRCooke, E Potent and Selective Inhibitors of CK2 Kinase Identified through Structure-Guided Hybridization. ACS Med Chem Lett3:278-283 (2012) 
 
Homeodomain-interacting protein kinase 2
Name:Homeodomain-interacting protein kinase 2
Type:Protein
Mol. Mass.:131001.90
Organism:Homo sapiens (Human)
Description:Q9H2X6
Residue:1198
BDBM50388781
NameBDBM50388781
Synonyms:CHEMBL2062585
TypeSmall organic molecule
Emp. Form.C23H21N7O3
Mol. Mass.443.4579
SMILESCC(=O)Nc1ccc2n(CCC(O)=O)cc(-c3cc(NC4CC4)n4ncc(C#N)c4n3)c2c1