Reaction Details
TargetDynamin-1
LigandBDBM50388828
Substrate/Competitorn/a
Meas. Tech.ChEMBL_831002 (CHEMBL2065654)
IC50 7000±n/a nM
Citation Robertson, MJHadzic, GAmbrus, JPomè, DYHyde, EWhiting, AMariana, Avon Kleist, LChau, NHaucke, VRobinson, PJMcCluskey, A The Rhodadyns, a New Class of Small Molecule Inhibitors of Dynamin GTPase Activity. ACS Med Chem Lett3:352-356 (2012) 
 
Dynamin-1
Name:Dynamin-1
Type:PROTEIN
Mol. Mass.:97411.67
Organism:Homo sapiens (Human)
Description:ChEMBL_1458576
Residue:864
BDBM50388828
NameBDBM50388828
Synonyms:CHEMBL2062743
TypeSmall organic molecule
Emp. Form.C17H22N2O2S2
Mol. Mass.350.499
SMILESCCN1C(=S)S\C(=C/c2ccc(OCCCN(C)C)cc2)C1=O