Reaction Details
TargetMetabotropic glutamate receptor 5
LigandBDBM50243108
Substrate/Competitorn/a
Meas. Tech.ChEMBL_830804 (CHEMBL2065269)
IC50 486±n/a nM
Citation Melancon, BJHopkins, CRWood, MREmmitte, KANiswender, CMChristopoulos, AConn, PJLindsley, CW Allosteric modulation of seven transmembrane spanning receptors: theory, practice, and opportunities for central nervous system drug discovery. J Med Chem55:1445-64 (2012) 
 
Metabotropic glutamate receptor 5
Name:Metabotropic glutamate receptor 5
Type:Enzyme
Mol. Mass.:132484.72
Organism:Homo sapiens (Human)
Description:n/a
Residue:1212
BDBM50243108
NameBDBM50243108
Synonyms:5-(phenylethynyl)pyrimidine | CHEMBL486244
TypeSmall organic molecule
Emp. Form.C12H8N2
Mol. Mass.180.2053
SMILESc1ccc(cc1)C#Cc1cncnc1