Reaction Details
TargetC3a anaphylatoxin chemotactic receptor
LigandBDBM50389006
Substrate/Competitorn/a
Meas. Tech.ChEMBL_832881 (CHEMBL2066643)
IC50 63.1±n/a nM
Citation Bellows-Peterson, MLFung, HKFloudas, CAKieslich, CAZhang, LMorikis, DWareham, KJMonk, PNHawksworth, OAWoodruff, TM De novo peptide design with C3a receptor agonist and antagonist activities: theoretical predictions and experimental validation. J Med Chem55:4159-68 (2012) 
 
C3a anaphylatoxin chemotactic receptor
Name:C3a anaphylatoxin chemotactic receptor
Type:PROTEIN
Mol. Mass.:53864.66
Organism:Homo sapiens (Human)
Description:ChEMBL_642034
Residue:482
BDBM50389006
NameBDBM50389006
Synonyms:CHEMBL2064020
TypeSmall organic molecule
Emp. Form.C91H139N31O19
Mol. Mass.1971.2737
SMILESCC(C)C[C@H](NC(=O)CNC(=O)[C@H](CC(C)C)NC(=O)[C@H](CCCCN)NC(=O)[C@H](CO)NC(=O)[C@H](C)NC(=O)[C@H](CCCN=C(N)N)NC(=O)[C@H](Cc1c[nH]c2ccccc12)NC(=O)[C@H](CCCN=C(N)N)NC(=O)[C@H](CCCN=C(N)N)NC(=O)[C@H](CO)NC(=O)[C@H](Cc1c[nH]c2ccccc12)NC(=O)[C@H](Cc1c[nH]c2ccccc12)NC(C)=O)C(=O)N[C@@H](C)C(=O)N[C@@H](CCCN=C(N)N)C(O)=O