Reaction Details
TargetC3a anaphylatoxin chemotactic receptor
LigandBDBM50388997
Substrate/Competitorn/a
Meas. Tech.ChEMBL_832880 (CHEMBL2066642)
EC50 1000±n/a nM
Citation Bellows-Peterson, MLFung, HKFloudas, CAKieslich, CAZhang, LMorikis, DWareham, KJMonk, PNHawksworth, OAWoodruff, TM De novo peptide design with C3a receptor agonist and antagonist activities: theoretical predictions and experimental validation. J Med Chem55:4159-68 (2012) 
 
C3a anaphylatoxin chemotactic receptor
Name:C3a anaphylatoxin chemotactic receptor
Type:PROTEIN
Mol. Mass.:53864.66
Organism:Homo sapiens (Human)
Description:ChEMBL_642034
Residue:482
BDBM50388997
NameBDBM50388997
Synonyms:CHEMBL2064011
TypeSmall organic molecule
Emp. Form.C90H140N30O20
Mol. Mass.1962.2636
SMILESCC(C)C[C@H](NC(=O)CNC(=O)[C@H](CC(C)C)NC(=O)[C@H](CCCCN)NC(=O)[C@H](CO)NC(=O)[C@H](C)NC(=O)[C@H](CCCN=C(N)N)NC(=O)[C@H](Cc1ccc(O)cc1)NC(=O)[C@H](CCCN=C(N)N)NC(=O)[C@H](CCCN=C(N)N)NC(=O)[C@@H](NC(=O)[C@H](Cc1c[nH]c2ccccc12)NC(=O)[C@H](Cc1c[nH]c2ccccc12)NC(C)=O)[C@@H](C)O)C(=O)N[C@@H](C)C(=O)N[C@@H](CCCN=C(N)N)C(O)=O