Reaction Details
TargetALK tyrosine kinase receptor
LigandBDBM50389153
Substrate/Competitorn/a
Meas. Tech.ChEMBL_833218 (CHEMBL2067582)
IC50 30±n/a nM
Citation Gingrich, DELisko, JGCurry, MACheng, MQuail, MLu, LWan, WAlbom, MSAngeles, TSAimone, LDHaltiwanger, RCWells-Knecht, KOtt, GRGhose, AKAtor, MARuggeri, BDorsey, BD Discovery of an orally efficacious inhibitor of anaplastic lymphoma kinase. J Med Chem55:4580-93 (2012) 
 
ALK tyrosine kinase receptor
Name:ALK tyrosine kinase receptor
Type:Protein
Mol. Mass.:176453.10
Organism:Homo sapiens (Human)
Description:Q9UM73
Residue:1620
BDBM50389153
NameBDBM50389153
Synonyms:CHEMBL2064663
TypeSmall organic molecule
Emp. Form.C27H35ClN6O3
Mol. Mass.527.058
SMILESCOCCN[C@@H]1CCc2ccc(Nc3ncc(Cl)c(N[C@@H]4[C@@H]5C[C@@H](C=C5)[C@@H]4C(N)=O)n3)c(OC)c2CC1