Reaction Details
TargetALK tyrosine kinase receptor
LigandBDBM50389152
Substrate/Competitorn/a
Meas. Tech.ChEMBL_833217 (CHEMBL2067581)
IC50 16.0±n/a nM
Citation Gingrich, DELisko, JGCurry, MACheng, MQuail, MLu, LWan, WAlbom, MSAngeles, TSAimone, LDHaltiwanger, RCWells-Knecht, KOtt, GRGhose, AKAtor, MARuggeri, BDorsey, BD Discovery of an orally efficacious inhibitor of anaplastic lymphoma kinase. J Med Chem55:4580-93 (2012) 
 
ALK tyrosine kinase receptor
Name:ALK tyrosine kinase receptor
Type:Protein
Mol. Mass.:176453.10
Organism:Homo sapiens (Human)
Description:Q9UM73
Residue:1620
BDBM50389152
NameBDBM50389152
Synonyms:CHEMBL2064667
TypeSmall organic molecule
Emp. Form.C28H35ClN6O3
Mol. Mass.539.069
SMILESCOc1cc2CCC(CCc2cc1Nc1ncc(Cl)c(N[C@@H]2[C@@H]3C[C@@H](C=C3)[C@@H]2C(N)=O)n1)N1CCOCC1