Reaction Details
TargetALK tyrosine kinase receptor
LigandBDBM50334593
Substrate/Competitorn/a
Meas. Tech.ChEMBL_833217 (CHEMBL2067581)
IC50 4±n/a nM
Citation Gingrich, DELisko, JGCurry, MACheng, MQuail, MLu, LWan, WAlbom, MSAngeles, TSAimone, LDHaltiwanger, RCWells-Knecht, KOtt, GRGhose, AKAtor, MARuggeri, BDorsey, BD Discovery of an orally efficacious inhibitor of anaplastic lymphoma kinase. J Med Chem55:4580-93 (2012) 
 
ALK tyrosine kinase receptor
Name:ALK tyrosine kinase receptor
Type:Protein
Mol. Mass.:176453.10
Organism:Homo sapiens (Human)
Description:Q9UM73
Residue:1620
BDBM50334593
NameBDBM50334593
Synonyms:2-(7-(5-chloro-4-(2-methoxy-4-morpholinophenylamino)pyrimidin-2-ylamino)-8-methoxy-4,5-dihydro-1H-benzo[d]azepin-3(2H)-yl)-N,N-dimethylacetamide | CHEMBL1642258
TypeSmall organic molecule
Emp. Form.C30H38ClN7O4
Mol. Mass.596.12
SMILESCOc1cc(ccc1Nc1nc(Nc2cc3CCN(CC(=O)N(C)C)CCc3cc2OC)ncc1Cl)N1CCOCC1