Reaction Details
TargetALK tyrosine kinase receptor
LigandBDBM50385590
Substrate/Competitorn/a
Meas. Tech.ChEMBL_833217 (CHEMBL2067581)
IC50 14±n/a nM
Citation Gingrich, DELisko, JGCurry, MACheng, MQuail, MLu, LWan, WAlbom, MSAngeles, TSAimone, LDHaltiwanger, RCWells-Knecht, KOtt, GRGhose, AKAtor, MARuggeri, BDorsey, BD Discovery of an orally efficacious inhibitor of anaplastic lymphoma kinase. J Med Chem55:4580-93 (2012) 
 
ALK tyrosine kinase receptor
Name:ALK tyrosine kinase receptor
Type:Protein
Mol. Mass.:176453.10
Organism:Homo sapiens (Human)
Description:Q9UM73
Residue:1620
BDBM50385590
NameBDBM50385590
Synonyms:CHEMBL2042829
TypeSmall organic molecule
Emp. Form.C25H29ClN6O3
Mol. Mass.496.989
SMILESCCN1c2ccc(Nc3ncc(Cl)c(N[C@@H]4[C@@H]5C[C@@H](C=C5)[C@@H]4C(N)=O)n3)c(OC)c2CCCC1=O