Reaction Details
TargetcAMP and cAMP-inhibited cGMP 3',5'-cyclic phosphodiesterase 10A
LigandBDBM50365964
Substrate/Competitorn/a
Meas. Tech.ChEMBL_834602 (CHEMBL2072402)
IC50 1.9±n/a nM
Citation Hu, EMa, JBiorn, CLester-Zeiner, DCho, RRumfelt, SKunz, RKNixey, TMichelsen, KMiller, SShi, JWong, JHill Della Puppa, GAble, JTalreja, SHwang, DRHitchcock, SAPorter, AImmke, DAllen, JRTreanor, JChen, H Rapid identification of a novel small molecule phosphodiesterase 10A (PDE10A) tracer. J Med Chem55:4776-87 (2012) 
 
cAMP and cAMP-inhibited cGMP 3',5'-cyclic phosphodiesterase 10A
Name:cAMP and cAMP-inhibited cGMP 3',5'-cyclic phosphodiesterase 10A
Type:Protein
Mol. Mass.:88412.52
Organism:Homo sapiens (Human)
Description:Q9Y233
Residue:1055
BDBM50365964
NameBDBM50365964
Synonyms:CHEMBL1956235 | CHEMBL2070530
TypeSmall organic molecule
Emp. Form.C19H22N4O2
Mol. Mass.338.4036
SMILESCOc1cc2nncc(-c3cnc(NC(C)C)c(C)c3)c2cc1OC