Reaction Details
TargetCathepsin D
LigandBDBM50390635
Substrate/Competitorn/a
Meas. Tech.ChEMBL_835454 (CHEMBL2072160)
IC50 300±n/a nM
Citation Vaiana, NMarzahn, MParapini, SLiu, PDell'Agli, MPancotti, ASangiovanni, EBasilico, NBosisio, EDunn, BMTaramelli, DRomeo, S Antiplasmodial activities of 4-aminoquinoline-statine compounds. Bioorg Med Chem Lett22:5915-8 (2012) 
 
Cathepsin D
Name:Cathepsin D
Type:Enzyme
Mol. Mass.:44551.72
Organism:Homo sapiens (Human)
Description:Human proCathepsin D (SwissProt accession number P07339) was expressed in Sf9 cells, purified, and autoactivated.
Residue:412
BDBM50390635
NameBDBM50390635
Synonyms:CHEMBL2069614
TypeSmall organic molecule
Emp. Form.C53H74N8O8
Mol. Mass.951.2035
SMILESCCCCNC(=O)C[C@H](O)[C@H](CC(C)C)NC(=O)[C@@H](NC(=O)c1ccc(Oc2ccc(cc2)C(=O)N[C@@H](CC(C)C)C(=O)N[C@@H](C)C(=O)NCCCNc2ccnc3ccccc23)cc1)[C@@H](C)CC