Reaction Details
TargetcAMP and cAMP-inhibited cGMP 3',5'-cyclic phosphodiesterase 10A
LigandBDBM50390813
Substrate/Competitorn/a
Meas. Tech.ChEMBL_835769 (CHEMBL2071880)
IC50 5.13±n/a nM
Citation Malamas, MSStange, HSchindler, RLankau, HJGrunwald, CLangen, BEgerland, UHage, TNi, YErdei, JFan, KYParris, KMarquis, KLGrauer, SBrennan, JNavarra, RGraf, RHarrison, BLRobichaud, AKronbach, TPangalos, MNBrandon, NJHoefgen, N Novel triazines as potent and selective phosphodiesterase 10A inhibitors. Bioorg Med Chem Lett22:5876-84 (2012) 
 
cAMP and cAMP-inhibited cGMP 3',5'-cyclic phosphodiesterase 10A
Name:cAMP and cAMP-inhibited cGMP 3',5'-cyclic phosphodiesterase 10A
Type:Protein
Mol. Mass.:88412.52
Organism:Homo sapiens (Human)
Description:Q9Y233
Residue:1055
BDBM50390813
NameBDBM50390813
Synonyms:CHEMBL2070649
TypeSmall organic molecule
Emp. Form.C19H18N4O2
Mol. Mass.334.3718
SMILESCOc1cc(OC)c2nnc3c(C)nc(-c4ccccc4C)n3c2c1