Reaction Details
TargetcAMP and cAMP-inhibited cGMP 3',5'-cyclic phosphodiesterase 10A
LigandBDBM50390816
Substrate/Competitorn/a
Meas. Tech.ChEMBL_835769 (CHEMBL2071880)
IC50 2.06±n/a nM
Citation Malamas, MSStange, HSchindler, RLankau, HJGrunwald, CLangen, BEgerland, UHage, TNi, YErdei, JFan, KYParris, KMarquis, KLGrauer, SBrennan, JNavarra, RGraf, RHarrison, BLRobichaud, AKronbach, TPangalos, MNBrandon, NJHoefgen, N Novel triazines as potent and selective phosphodiesterase 10A inhibitors. Bioorg Med Chem Lett22:5876-84 (2012) 
 
cAMP and cAMP-inhibited cGMP 3',5'-cyclic phosphodiesterase 10A
Name:cAMP and cAMP-inhibited cGMP 3',5'-cyclic phosphodiesterase 10A
Type:Protein
Mol. Mass.:88412.52
Organism:Homo sapiens (Human)
Description:Q9Y233
Residue:1055
BDBM50390816
NameBDBM50390816
Synonyms:CHEMBL2070653
TypeSmall organic molecule
Emp. Form.C18H17N5O2
Mol. Mass.335.3599
SMILESCOc1cc(OC)c2nnc3c(C)nc(-c4ccncc4C)n3c2c1