Reaction Details
TargetTransient receptor potential cation channel subfamily V member 1
LigandBDBM50391054
Substrate/Competitorn/a
Meas. Tech.ChEMBL_840432 (CHEMBL2089708)
IC50 223±n/a nM
Citation Besidski, YBrown, WBylund, JDabrowski, MDautrey, SHarter, MHoroszok, LHu, YJohnson, DJohnstone, SJones, PLeclerc, SKolmodin, KKers, ILabarre, MLabrecque, DLaird, JLundström, TMartino, JMaudet, MMunro, ANylöf, MPenwell, ARotticci, DSlaitas, ASundgren-Andersson, ASvensson, MTerp, GVillanueva, HWalpole, CZemribo, RGriffin, AM Potent and orally efficacious benzothiazole amides as TRPV1 antagonists. Bioorg Med Chem Lett22:6205-11 (2012) 
 
Transient receptor potential cation channel subfamily V member 1
Name:Transient receptor potential cation channel subfamily V member 1
Type:Protein
Mol. Mass.:94960.75
Organism:Homo sapiens (Human)
Description:Q8NER1
Residue:839
BDBM50391054
NameBDBM50391054
Synonyms:CHEMBL2088411
TypeSmall organic molecule
Emp. Form.C20H22N2O2S
Mol. Mass.354.466
SMILESCC(O)c1nc2cc(NC(=O)c3ccc(cc3)C(C)(C)C)ccc2s1