Reaction Details
TargetProtein kinase C gamma type
LigandBDBM50391386
Substrate/Competitorn/a
Meas. Tech.ChEMBL_848575 (CHEMBL2148239)
Ki 0.380000±n/a nM
Citation Kikumori, MYanagita, RCTokuda, HSuzuki, NNagai, HSuenaga, KIrie, K Structure-activity studies on the spiroketal moiety of a simplified analogue of debromoaplysiatoxin with antiproliferative activity. J Med Chem55:5614-26 (2012) 
 
Protein kinase C gamma type
Name:Protein kinase C gamma type
Type:Enzyme
Mol. Mass.:78458.05
Organism:Homo sapiens (Human)
Description:The recombinant human PKC enzymes were produced using a baculovirus expression system in SF9 cells
Residue:697
BDBM50391386
NameBDBM50391386
Synonyms:CHEMBL2148106
TypeSmall organic molecule
Emp. Form.C32H48O10
Mol. Mass.592.7175
SMILESCO[C@@H](CC[C@H](C)[C@H]1O[C@@]23C[C@H](OC(=O)C[C@@H](OC(=O)C[C@](O)(O2)[C@H](C)CC3(C)C)[C@@H](C)O)[C@@H]1C)c1cccc(O)c1