Reaction Details
TargetProtein kinase C beta type
LigandBDBM50391388
Substrate/Competitorn/a
Meas. Tech.ChEMBL_848574 (CHEMBL2148238)
Ki 12±n/a nM
Citation Kikumori, MYanagita, RCTokuda, HSuzuki, NNagai, HSuenaga, KIrie, K Structure-activity studies on the spiroketal moiety of a simplified analogue of debromoaplysiatoxin with antiproliferative activity. J Med Chem55:5614-26 (2012) 
 
Protein kinase C beta type
Name:Protein kinase C beta type
Type:Enzyme
Mol. Mass.:76873.67
Organism:Homo sapiens (Human)
Description:The recombinant human PKC enzymes were produced using a baculovirus expression system in SF9 cells
Residue:671
BDBM50391388
NameBDBM50391388
Synonyms:CHEMBL2148108
TypeSmall organic molecule
Emp. Form.C28H40O8
Mol. Mass.504.6124
SMILESC[C@@H]1[C@@H](CCCCc2cccc(O)c2)O[C@]23C[C@@H]1OC(=O)C[C@H](CO)OC(=O)C[C@@H](CCC2(C)C)O3