Reaction Details
TargetDipeptidyl peptidase 4
LigandBDBM50206058
Substrate/Competitorn/a
Meas. Tech.ChEMBL_850194 (CHEMBL2149800)
IC50 1.6±n/a nM
Citation Yoshida, TAkahoshi, FSakashita, HKitajima, HNakamura, MSonda, STakeuchi, MTanaka, YUeda, NSekiguchi, SIshige, TShima, KNabeno, MAbe, YAnabuki, JSoejima, AYoshida, KTakashina, YIshii, SKiuchi, SFukuda, STsutsumiuchi, RKosaka, KMurozono, TNakamaru, YUtsumi, HMasutomi, NKishida, HMiyaguchi, IHayashi, Y Discovery and preclinical profile of teneligliptin (3-[(2S,4S)-4-[4-(3-methyl-1-phenyl-1H-pyrazol-5-yl)piperazin-1-yl]pyrrolidin-2-ylcarbonyl]thiazolidine): a highly potent, selective, long-lasting and orally active dipeptidyl peptidase IV inhibitor for the treatment of type 2 diabetes. Bioorg Med Chem20:5705-19 (2012) 
 
Dipeptidyl peptidase 4
Name:Dipeptidyl peptidase 4
Type:Enzyme
Mol. Mass.:88271.01
Organism:Homo sapiens (Human)
Description:P27487
Residue:766
BDBM50206058
NameBDBM50206058
Synonyms:6-(4-((3S,5S)-5-(thiazolidine-3-carbonyl)pyrrolidin-3-yl)piperazin-1-yl)nicotinonitrile | CHEMBL241253
TypeSmall organic molecule
Emp. Form.C18H24N6OS
Mol. Mass.372.488
SMILESO=C([C@@H]1C[C@@H](CN1)N1CCN(CC1)c1ccc(cn1)C#N)N1CCSC1