Reaction Details
TargetPotassium voltage-gated channel subfamily H member 2
LigandBDBM50391760
Substrate/Competitorn/a
Meas. Tech.ChEMBL_849882 (CHEMBL2148626)
IC50 3.9±n/a nM
Citation Tang, HWalsh, SPYan, Yde Jesus, RKShahripour, ATeumelsan, NZhu, YHa, SOwens, KAThomas-Fowlkes, BSFelix, JPLiu, JKohler, MPriest, BTBailey, TBrochu, RAlonso-Galicia, MKaczorowski, GJRoy, SYang, LMills, SGGarcia, MLPasternak, A Discovery of Selective Small Molecule ROMK Inhibitors as Potential New Mechanism Diuretics. ACS Med Chem Lett3:367-372 (2012) 
 
Potassium voltage-gated channel subfamily H member 2
Name:Potassium voltage-gated channel subfamily H member 2
Type:Multi-pass membrane protein
Mol. Mass.:126672.65
Organism:Homo sapiens (Human)
Description:Q12809
Residue:1159
BDBM50391760
NameBDBM50391760
Synonyms:CHEMBL2146866
TypeSmall organic molecule
Emp. Form.C21H26N4O4
Mol. Mass.398.4555
SMILESCC(Cc1ccc(cc1)[N+]([O-])=O)N1CCN(CCc2ccc(cc2)[N+]([O-])=O)CC1