Reaction Details
TargetPotassium voltage-gated channel subfamily H member 2
LigandBDBM50391776
Substrate/Competitorn/a
Meas. Tech.ChEMBL_849882 (CHEMBL2148626)
IC50 12±n/a nM
Citation Tang, HWalsh, SPYan, Yde Jesus, RKShahripour, ATeumelsan, NZhu, YHa, SOwens, KAThomas-Fowlkes, BSFelix, JPLiu, JKohler, MPriest, BTBailey, TBrochu, RAlonso-Galicia, MKaczorowski, GJRoy, SYang, LMills, SGGarcia, MLPasternak, A Discovery of Selective Small Molecule ROMK Inhibitors as Potential New Mechanism Diuretics. ACS Med Chem Lett3:367-372 (2012) 
 
Potassium voltage-gated channel subfamily H member 2
Name:Potassium voltage-gated channel subfamily H member 2
Type:Multi-pass membrane protein
Mol. Mass.:126672.65
Organism:Homo sapiens (Human)
Description:Q12809
Residue:1159
BDBM50391776
NameBDBM50391776
Synonyms:CHEMBL2146868
TypeSmall organic molecule
Emp. Form.C22H24N4
Mol. Mass.344.4528
SMILESN#Cc1ccc(CCN2CCN(CCc3ccc(cc3)C#N)CC2)cc1