Reaction Details
TargetATP-sensitive inward rectifier potassium channel 1
LigandBDBM50391770
Substrate/Competitorn/a
Meas. Tech.ChEMBL_849886 (CHEMBL2148630)
IC50 24±n/a nM
Citation Tang, HWalsh, SPYan, Yde Jesus, RKShahripour, ATeumelsan, NZhu, YHa, SOwens, KAThomas-Fowlkes, BSFelix, JPLiu, JKohler, MPriest, BTBailey, TBrochu, RAlonso-Galicia, MKaczorowski, GJRoy, SYang, LMills, SGGarcia, MLPasternak, A Discovery of Selective Small Molecule ROMK Inhibitors as Potential New Mechanism Diuretics. ACS Med Chem Lett3:367-372 (2012) 
 
ATP-sensitive inward rectifier potassium channel 1
Name:ATP-sensitive inward rectifier potassium channel 1
Type:Enzyme Catalytic Domain
Mol. Mass.:44809.08
Organism:Homo sapiens (Human)
Description:gi_223460826
Residue:391
BDBM50391770
NameBDBM50391770
Synonyms:CHEMBL2146755 | US9073882, 1
TypeSmall organic molecule
Emp. Form.C20H24N4O4
Mol. Mass.384.429
SMILES[O-][N+](=O)c1ccc(CCN2CCN(CCc3ccc(cc3)[N+]([O-])=O)CC2)cc1