Reaction Details
TargetATP-sensitive inward rectifier potassium channel 1
LigandBDBM50391760
Substrate/Competitorn/a
Meas. Tech.ChEMBL_849881 (CHEMBL2148625)
IC50 240±n/a nM
Citation Tang, HWalsh, SPYan, Yde Jesus, RKShahripour, ATeumelsan, NZhu, YHa, SOwens, KAThomas-Fowlkes, BSFelix, JPLiu, JKohler, MPriest, BTBailey, TBrochu, RAlonso-Galicia, MKaczorowski, GJRoy, SYang, LMills, SGGarcia, MLPasternak, A Discovery of Selective Small Molecule ROMK Inhibitors as Potential New Mechanism Diuretics. ACS Med Chem Lett3:367-372 (2012) 
 
ATP-sensitive inward rectifier potassium channel 1
Name:ATP-sensitive inward rectifier potassium channel 1
Type:Enzyme Catalytic Domain
Mol. Mass.:44809.08
Organism:Homo sapiens (Human)
Description:gi_223460826
Residue:391
BDBM50391760
NameBDBM50391760
Synonyms:CHEMBL2146866
TypeSmall organic molecule
Emp. Form.C21H26N4O4
Mol. Mass.398.4555
SMILESCC(Cc1ccc(cc1)[N+]([O-])=O)N1CCN(CCc2ccc(cc2)[N+]([O-])=O)CC1