Reaction Details
TargetATP-sensitive inward rectifier potassium channel 1
LigandBDBM50391781
Substrate/Competitorn/a
Meas. Tech.ChEMBL_849881 (CHEMBL2148625)
IC50 49±n/a nM
Citation Tang, HWalsh, SPYan, Yde Jesus, RKShahripour, ATeumelsan, NZhu, YHa, SOwens, KAThomas-Fowlkes, BSFelix, JPLiu, JKohler, MPriest, BTBailey, TBrochu, RAlonso-Galicia, MKaczorowski, GJRoy, SYang, LMills, SGGarcia, MLPasternak, A Discovery of Selective Small Molecule ROMK Inhibitors as Potential New Mechanism Diuretics. ACS Med Chem Lett3:367-372 (2012) 
 
ATP-sensitive inward rectifier potassium channel 1
Name:ATP-sensitive inward rectifier potassium channel 1
Type:Enzyme Catalytic Domain
Mol. Mass.:44809.08
Organism:Homo sapiens (Human)
Description:gi_223460826
Residue:391
BDBM50391781
NameBDBM50391781
Synonyms:CHEMBL2146873 | US9073882, 38
TypeSmall organic molecule
Emp. Form.C23H24FN3O2
Mol. Mass.393.454
SMILESFc1cc(CCN2CCN(CCc3ccc4C(=O)OCc4c3)CC2)ccc1C#N