Reaction Details
TargetPotassium voltage-gated channel subfamily H member 2
LigandBDBM50391770
Substrate/Competitorn/a
Meas. Tech.ChEMBL_849882 (CHEMBL2148626)
IC50 5±n/a nM
Citation Tang, HWalsh, SPYan, Yde Jesus, RKShahripour, ATeumelsan, NZhu, YHa, SOwens, KAThomas-Fowlkes, BSFelix, JPLiu, JKohler, MPriest, BTBailey, TBrochu, RAlonso-Galicia, MKaczorowski, GJRoy, SYang, LMills, SGGarcia, MLPasternak, A Discovery of Selective Small Molecule ROMK Inhibitors as Potential New Mechanism Diuretics. ACS Med Chem Lett3:367-372 (2012) 
 
Potassium voltage-gated channel subfamily H member 2
Name:Potassium voltage-gated channel subfamily H member 2
Type:Multi-pass membrane protein
Mol. Mass.:126672.65
Organism:Homo sapiens (Human)
Description:Q12809
Residue:1159
BDBM50391770
NameBDBM50391770
Synonyms:CHEMBL2146755 | US9073882, 1
TypeSmall organic molecule
Emp. Form.C20H24N4O4
Mol. Mass.384.429
SMILES[O-][N+](=O)c1ccc(CCN2CCN(CCc3ccc(cc3)[N+]([O-])=O)CC2)cc1