Reaction Details
TargetBeta-secretase 1
LigandBDBM50383838
Substrate/Competitorn/a
Meas. Tech.ChEMBL_853105 (CHEMBL2154573)
IC50 1.8±n/a nM
Citation Kaller, MRHarried, SSAlbrecht, BAmarante, PBabu-Khan, SBartberger, MDBrown, JBrown, RChen, KCheng, YCitron, MCroghan, MDGraceffa, RHickman, DJudd, TKriemen, CLa, DLi, VLopez, PLuo, YMasse, CMonenschein, HNguyen, TPennington, LDMiguel, TSSickmier, EAWahl, RCWeiss, MMWen, PHWilliamson, TWood, SXue, MYang, BZhang, JPatel, VZhong, WHitchcock, S A Potent and Orally Efficacious, Hydroxyethylamine-Based Inhibitor of ß-Secretase. ACS Med Chem Lett3:886-891 (2012) 
 
Beta-secretase 1
Name:Beta-secretase 1
Type:Protein
Mol. Mass.:55755.10
Organism:Homo sapiens (Human)
Description:P56817
Residue:501
BDBM50383838
NameBDBM50383838
Synonyms:CHEMBL2030996
TypeSmall organic molecule
Emp. Form.C28H38FN3O3
Mol. Mass.483.618
SMILESCC(=O)N[C@@H](Cc1cccc(F)c1)[C@H](O)CN[C@H]1CC2(CCC2)Oc2ncc(CC(C)(C)C)cc12