Reaction Details
TargetPotassium voltage-gated channel subfamily H member 2
LigandBDBM50392790
Substrate/Competitorn/a
Meas. Tech.ChEMBL_853148 (CHEMBL2154697)
IC50>32000±n/a nM
Citation Wang, TLamb, MLBlock, MHDavies, AMHan, YHoffmann, EIoannidis, SJosey, JALiu, ZYLyne, PDMacIntyre, TMohr, PJOmer, CASjögren, TThress, KWang, BWang, HYu, DZhang, HJ Discovery of Disubstituted Imidazo[4,5-b]pyridines and Purines as Potent TrkA Inhibitors. ACS Med Chem Lett3:705-709 (2012) 
 
Potassium voltage-gated channel subfamily H member 2
Name:Potassium voltage-gated channel subfamily H member 2
Type:Multi-pass membrane protein
Mol. Mass.:126672.65
Organism:Homo sapiens (Human)
Description:Q12809
Residue:1159
BDBM50392790
NameBDBM50392790
Synonyms:CHEMBL2151320 | US8486966, 16
TypeSmall organic molecule
Emp. Form.C16H15FN8
Mol. Mass.338.3423
SMILESC[C@H](Nc1ccc2ncn(-c3cc(C)[nH]n3)c2n1)c1ncc(F)cn1