Reaction Details
TargetPotassium voltage-gated channel subfamily H member 2
LigandBDBM50392792
Substrate/Competitorn/a
Meas. Tech.ChEMBL_853148 (CHEMBL2154697)
IC50 52000±n/a nM
Citation Wang, TLamb, MLBlock, MHDavies, AMHan, YHoffmann, EIoannidis, SJosey, JALiu, ZYLyne, PDMacIntyre, TMohr, PJOmer, CASjögren, TThress, KWang, BWang, HYu, DZhang, HJ Discovery of Disubstituted Imidazo[4,5-b]pyridines and Purines as Potent TrkA Inhibitors. ACS Med Chem Lett3:705-709 (2012) 
 
Potassium voltage-gated channel subfamily H member 2
Name:Potassium voltage-gated channel subfamily H member 2
Type:Multi-pass membrane protein
Mol. Mass.:126672.65
Organism:Homo sapiens (Human)
Description:Q12809
Residue:1159
BDBM50392792
NameBDBM50392792
Synonyms:CHEMBL2151322 | US8486966, 7
TypeSmall organic molecule
Emp. Form.C19H20FN7O2
Mol. Mass.397.4062
SMILESCC(C)Oc1cc(n[nH]1)-n1cnc2ccc(N[C@@H](CO)c3ccc(F)cn3)nc12