Reaction Details
TargetPotassium voltage-gated channel subfamily H member 2
LigandBDBM50392793
Substrate/Competitorn/a
Meas. Tech.ChEMBL_853148 (CHEMBL2154697)
IC50>32000±n/a nM
Citation Wang, TLamb, MLBlock, MHDavies, AMHan, YHoffmann, EIoannidis, SJosey, JALiu, ZYLyne, PDMacIntyre, TMohr, PJOmer, CASjögren, TThress, KWang, BWang, HYu, DZhang, HJ Discovery of Disubstituted Imidazo[4,5-b]pyridines and Purines as Potent TrkA Inhibitors. ACS Med Chem Lett3:705-709 (2012) 
 
Potassium voltage-gated channel subfamily H member 2
Name:Potassium voltage-gated channel subfamily H member 2
Type:Multi-pass membrane protein
Mol. Mass.:126672.65
Organism:Homo sapiens (Human)
Description:Q12809
Residue:1159
BDBM50392793
NameBDBM50392793
Synonyms:CHEMBL2151323 | US8486966, 12
TypeSmall organic molecule
Emp. Form.C17H18FN9O
Mol. Mass.383.3829
SMILESCC(C)Oc1cc(n[nH]1)-n1cnc2cnc(N[C@@H](C)c3ncc(F)cn3)nc12