Reaction Details
TargetTyrosine-protein kinase Fgr
LigandBDBM50392791
Substrate/Competitorn/a
Meas. Tech.ChEMBL_853155 (CHEMBL2154704)
IC50 2.2±n/a nM
Citation Wang, TLamb, MLBlock, MHDavies, AMHan, YHoffmann, EIoannidis, SJosey, JALiu, ZYLyne, PDMacIntyre, TMohr, PJOmer, CASjögren, TThress, KWang, BWang, HYu, DZhang, HJ Discovery of Disubstituted Imidazo[4,5-b]pyridines and Purines as Potent TrkA Inhibitors. ACS Med Chem Lett3:705-709 (2012) 
 
Tyrosine-protein kinase Fgr
Name:Tyrosine-protein kinase Fgr
Type:protein
Mol. Mass.:59469.88
Organism:Homo sapiens (Human)
Description:P09769
Residue:529
BDBM50392791
NameBDBM50392791
Synonyms:CHEMBL2151321 | US8486966, 1
TypeSmall organic molecule
Emp. Form.C19H20FN7O
Mol. Mass.381.4068
SMILESCC(C)Oc1cc(n[nH]1)-n1cnc2ccc(N[C@@H](C)c3ccc(F)cn3)nc12