Reaction Details
TargetVascular endothelial growth factor receptor 3
LigandBDBM50392791
Substrate/Competitorn/a
Meas. Tech.ChEMBL_853166 (CHEMBL2154715)
IC50 64±n/a nM
Citation Wang, TLamb, MLBlock, MHDavies, AMHan, YHoffmann, EIoannidis, SJosey, JALiu, ZYLyne, PDMacIntyre, TMohr, PJOmer, CASjögren, TThress, KWang, BWang, HYu, DZhang, HJ Discovery of Disubstituted Imidazo[4,5-b]pyridines and Purines as Potent TrkA Inhibitors. ACS Med Chem Lett3:705-709 (2012) 
 
Vascular endothelial growth factor receptor 3
Name:Vascular endothelial growth factor receptor 3
Type:Protein
Mol. Mass.:152749.58
Organism:Homo sapiens (Human)
Description:P35916-2
Residue:1363
BDBM50392791
NameBDBM50392791
Synonyms:CHEMBL2151321 | US8486966, 1
TypeSmall organic molecule
Emp. Form.C19H20FN7O
Mol. Mass.381.4068
SMILESCC(C)Oc1cc(n[nH]1)-n1cnc2ccc(N[C@@H](C)c3ccc(F)cn3)nc12