Reaction Details
TargetCoagulation factor XIII A chain
LigandBDBM50392906
Substrate/Competitorn/a
Meas. Tech.ChEMBL_853393 (CHEMBL2155213)
IC50 6400±n/a nM
Citation Prime, MEBrookfield, FACourtney, SMGaines, SMarston, RWIchihara, OLi, MVaidya, DWilliams, HPedret-Dunn, AReed, LSchaertl, SToledo-Sherman, LBeconi, MMacdonald, DMuņoz-Sanjuan, IDominguez, CWityak, J Irreversible 4-Aminopiperidine Transglutaminase 2 Inhibitors for Huntington's Disease. ACS Med Chem Lett3:731-735 (2012) 
 
Coagulation factor XIII A chain
Name:Coagulation factor XIII A chain
Type:PROTEIN
Mol. Mass.:83261.29
Organism:Homo sapiens (Human)
Description:ChEMBL_1475048
Residue:732
BDBM50392906
NameBDBM50392906
Synonyms:CHEMBL2152204
TypeSmall organic molecule
Emp. Form.C24H29N3O5S
Mol. Mass.471.569
SMILESCOc1ccc(CCNC(=O)c2ccc(cc2)S(=O)(=O)N2CCC(CC2)NC(=O)C=C)cc1