Reaction Details
Target11-beta-hydroxysteroid dehydrogenase 1
LigandBDBM50392919
Substrate/Competitorn/a
Meas. Tech.ChEMBL_853422 (CHEMBL2155280)
IC50 0.4±n/a nM
Citation Yu, JLiu, HXia, GLiu, LXu, ZChen, QMa, CSun, XXu, JLi, HLi, PShi, YXiong, BLiu, XShen, J Discovery of 2-Alkyl-1-arylsulfonylprolinamides as 11ß-Hydroxysteroid Dehydrogenase Type 1 Inhibitors. ACS Med Chem Lett3:793-798 (2012) 
 
11-beta-hydroxysteroid dehydrogenase 1
Name:11-beta-hydroxysteroid dehydrogenase 1
Type:Enzyme
Mol. Mass.:32409.16
Organism:Homo sapiens (Human)
Description:P28845
Residue:292
BDBM50392919
NameBDBM50392919
Synonyms:CHEMBL2152217
TypeSmall organic molecule
Emp. Form.C23H33ClN2O3S
Mol. Mass.453.038
SMILESCc1c(Cl)cccc1S(=O)(=O)N1CCC[C@@H](C1)C(=O)N[C@H]1C[C@H]2CC[C@]1(C)C2(C)C