Reaction Details
Target11-beta-hydroxysteroid dehydrogenase 1
LigandBDBM50392924
Substrate/Competitorn/a
Meas. Tech.ChEMBL_853422 (CHEMBL2155280)
IC50 0.1±n/a nM
Citation Yu, JLiu, HXia, GLiu, LXu, ZChen, QMa, CSun, XXu, JLi, HLi, PShi, YXiong, BLiu, XShen, J Discovery of 2-Alkyl-1-arylsulfonylprolinamides as 11ß-Hydroxysteroid Dehydrogenase Type 1 Inhibitors. ACS Med Chem Lett3:793-798 (2012) 
 
11-beta-hydroxysteroid dehydrogenase 1
Name:11-beta-hydroxysteroid dehydrogenase 1
Type:Enzyme
Mol. Mass.:32409.16
Organism:Homo sapiens (Human)
Description:P28845
Residue:292
BDBM50392924
NameBDBM50392924
Synonyms:CHEMBL2152223
TypeSmall organic molecule
Emp. Form.C23H31ClN2O4S
Mol. Mass.467.021
SMILESCc1c(Cl)cccc1S(=O)(=O)N1CCC[C@]1(C)C(=O)N[C@H]1C2CC3CC1C[C@](O)(C3)C2