Reaction Details
TargetMatrix metalloproteinase-14
LigandBDBM50393110
Substrate/Competitorn/a
Meas. Tech.ChEMBL_853831 (CHEMBL2154857)
IC50 15900±n/a nM
Citation Shengule, SRLoa-Kum-Cheung, WLParish, CRBlairvacq, MMeijer, LNakao, YKaruso, P A one-pot synthesis and biological activity of ageladine A and analogues. J Med Chem54:2492-503 (2011) 
 
Matrix metalloproteinase-14
Name:Matrix metalloproteinase-14
Type:Protein
Mol. Mass.:65900.19
Organism:Homo sapiens (Human)
Description:P50281
Residue:582
BDBM50393110
NameBDBM50393110
Synonyms:CHEMBL2153260
TypeSmall organic molecule
Emp. Form.C10H8N4O
Mol. Mass.200.1967
SMILESNc1nc2c(nccc2[nH]1)-c1ccco1