Reaction Details
TargetSuccinate receptor 1
LigandBDBM50393136
Substrate/Competitorn/a
Meas. Tech.ChEMBL_852820 (CHEMBL2156127)
IC50 16±n/a nM
Citation Bhuniya, DUmrani, DDave, BSalunke, DKukreja, GGundu, JNaykodi, MShaikh, NSShitole, PKurhade, SDe, SMajumdar, SReddy, SBTambe, SShejul, YChugh, APalle, VPMookhtiar, KACully, DVacca, JChakravarty, PKNargund, RPWright, SDGraziano, MPSingh, SBRoy, SCai, TQ Discovery of a potent and selective small molecule hGPR91 antagonist. Bioorg Med Chem Lett21:3596-602 (2011) 
 
Succinate receptor 1
Name:Succinate receptor 1
Type:PROTEIN
Mol. Mass.:38709.48
Organism:Homo sapiens (Human)
Description:ChEMBL_852820
Residue:334
BDBM50393136
NameBDBM50393136
Synonyms:CHEMBL2153468
TypeSmall organic molecule
Emp. Form.C32H22F7N3O2
Mol. Mass.613.5248
SMILESC[C@H](NC(=O)C(O)(c1ccc(cc1)-c1ccc2cccnc2n1)C(F)(F)F)c1ccc(cc1)-c1ccc(F)c(c1)C(F)(F)F