Reaction Details
TargetSuccinate receptor 1
LigandBDBM50393150
Substrate/Competitorn/a
Meas. Tech.ChEMBL_852820 (CHEMBL2156127)
IC50 200±n/a nM
Citation Bhuniya, DUmrani, DDave, BSalunke, DKukreja, GGundu, JNaykodi, MShaikh, NSShitole, PKurhade, SDe, SMajumdar, SReddy, SBTambe, SShejul, YChugh, APalle, VPMookhtiar, KACully, DVacca, JChakravarty, PKNargund, RPWright, SDGraziano, MPSingh, SBRoy, SCai, TQ Discovery of a potent and selective small molecule hGPR91 antagonist. Bioorg Med Chem Lett21:3596-602 (2011) 
 
Succinate receptor 1
Name:Succinate receptor 1
Type:PROTEIN
Mol. Mass.:38709.48
Organism:Homo sapiens (Human)
Description:ChEMBL_852820
Residue:334
BDBM50393150
NameBDBM50393150
Synonyms:CHEMBL2153588
TypeSmall organic molecule
Emp. Form.C26H19F3N4O
Mol. Mass.460.4505
SMILESFC(F)(F)c1cccc(c1)-c1ccc(cc1)-c1nnc(CCCc2ccc3cccnc3n2)o1