Reaction Details
TargetAdenosine receptor A2b
LigandBDBM50393167
Substrate/Competitorn/a
Meas. Tech.ChEMBL_853229 (CHEMBL2154930)
Ki 1540±n/a nM
Citation Drabczynska, AYuzlenko, OKöse, MPaskaleva, MSchiedel, ACKarolak-Wojciechowska, JHandzlik, JKarcz, TKuder, KMüller, CEKiec-Kononowicz, K Synthesis and biological activity of tricyclic cycloalkylimidazo-, pyrimido- and diazepinopurinediones. Eur J Med Chem46:3590-607 (2011) 
 
Adenosine receptor A2b
Name:Adenosine receptor A2b
Type:G Protein-Coupled Receptor (GPCR)
Mol. Mass.:36341.22
Organism:Homo sapiens (Human)
Description:n/a
Residue:332
BDBM50393167
NameBDBM50393167
Synonyms:CHEMBL2153721
TypeSmall organic molecule
Emp. Form.C19H24N4O4
Mol. Mass.372.4183
SMILESCCCn1c2nc([nH]c2c(=O)n(CCC)c1=O)C1C2CC3OC(=O)C1C3C2