Reaction Details
TargetAdenosine receptor A3
LigandBDBM50393190
Substrate/Competitorn/a
Meas. Tech.ChEMBL_853050 (CHEMBL2154397)
Ki 1670±n/a nM
Citation Drabczynska, AYuzlenko, OKöse, MPaskaleva, MSchiedel, ACKarolak-Wojciechowska, JHandzlik, JKarcz, TKuder, KMüller, CEKiec-Kononowicz, K Synthesis and biological activity of tricyclic cycloalkylimidazo-, pyrimido- and diazepinopurinediones. Eur J Med Chem46:3590-607 (2011) 
 
Adenosine receptor A3
Name:Adenosine receptor A3
Type:G Protein-Coupled Receptor (GPCR)
Mol. Mass.:36197.32
Organism:Homo sapiens (Human)
Description:P0DMS8
Residue:318
BDBM50393190
NameBDBM50393190
Synonyms:CHEMBL2153603
TypeSmall organic molecule
Emp. Form.C19H29N5O2
Mol. Mass.359.4659
SMILESCn1c2nc3N(CCCCn3c2c(=O)n(C)c1=O)C1CCCCCCC1