Reaction Details
TargetAdenosine receptor A2a
LigandBDBM50393191
Substrate/Competitorn/a
Meas. Tech.ChEMBL_852589 (CHEMBL2156700)
Ki 810±n/a nM
Citation Drabczynska, AYuzlenko, OKöse, MPaskaleva, MSchiedel, ACKarolak-Wojciechowska, JHandzlik, JKarcz, TKuder, KMüller, CEKiec-Kononowicz, K Synthesis and biological activity of tricyclic cycloalkylimidazo-, pyrimido- and diazepinopurinediones. Eur J Med Chem46:3590-607 (2011) 
 
Adenosine receptor A2a
Name:Adenosine receptor A2a
Type:G Protein-Coupled Receptor (GPCR)
Mol. Mass.:45015.65
Organism:Rattus norvegicus (rat)
Description:Rat A2A receptors expressed in CHO cells.
Residue:410
BDBM50393191
NameBDBM50393191
Synonyms:CHEMBL2153624
TypeSmall organic molecule
Emp. Form.C16H23N5O2
Mol. Mass.317.3861
SMILESCn1c2nc3N(CCCn3c2c(=O)n(C)c1=O)C1CCCCC1