Reaction Details
TargetProtein kinase C delta type
LigandBDBM50393218
Substrate/Competitorn/a
Meas. Tech.ChEMBL_850744 (CHEMBL2156013)
IC50 0.400000±n/a nM
Citation Wagner, Jvon Matt, PFaller, BCooke, NGAlbert, RSedrani, RWiegand, HJean, CBeerli, CWeckbecker, GEvenou, JPZenke, GCottens, S Structure-activity relationship and pharmacokinetic studies of sotrastaurin (AEB071), a promising novel medicine for prevention of graft rejection and treatment of psoriasis. J Med Chem54:6028-39 (2011) 
 
Protein kinase C delta type
Name:Protein kinase C delta type
Type:Enzyme
Mol. Mass.:77516.79
Organism:Homo sapiens (Human)
Description:The recombinant human PKC enzymes were produced using a baculovirus expression system in SF9 cells
Residue:676
BDBM50393218
NameBDBM50393218
Synonyms:CHEMBL1996510
TypeSmall organic molecule
Emp. Form.C24H20N6O2
Mol. Mass.424.4546
SMILESO=C1NC(=O)C(=C1c1c[nH]c2ccccc12)c1nc(nc2ccccc12)N1CCNCC1