Reaction Details
TargetProtein kinase C beta type
LigandBDBM33970
Substrate/Competitorn/a
Meas. Tech.ChEMBL_850743 (CHEMBL2156012)
IC50 1.8±n/a nM
Citation Wagner, Jvon Matt, PFaller, BCooke, NGAlbert, RSedrani, RWiegand, HJean, CBeerli, CWeckbecker, GEvenou, JPZenke, GCottens, S Structure-activity relationship and pharmacokinetic studies of sotrastaurin (AEB071), a promising novel medicine for prevention of graft rejection and treatment of psoriasis. J Med Chem54:6028-39 (2011) 
 
Protein kinase C beta type
Name:Protein kinase C beta type
Type:Enzyme
Mol. Mass.:76873.67
Organism:Homo sapiens (Human)
Description:The recombinant human PKC enzymes were produced using a baculovirus expression system in SF9 cells
Residue:671
BDBM33970
NameBDBM33970
Synonyms:maleimide derivative, 12
TypeSmall organic molecule
Emp. Form.C27H24N4O2
Mol. Mass.436.5051
SMILESCN1CCN(CC1)c1cc(C2=C(C(=O)NC2=O)c2c[nH]c3ccccc23)c2ccccc2c1