Reaction Details
TargetFatty-acid amide hydrolase 1
LigandBDBM26740
Substrate/Competitorn/a
Meas. Tech.ChEMBL_851005 (CHEMBL2157385)
IC50 33±n/a nM
Citation Feledziak, MMuccioli, GGLambert, DMMarchand-Brynaert, J SAR and LC/MS studies ofß-lactamic inhibitors of human fatty acid amide hydrolase (hFAAH): evidence of a nonhydrolytic process. J Med Chem54:6812-23 (2011) 
 
Fatty-acid amide hydrolase 1
Name:Fatty-acid amide hydrolase 1
Type:Protein
Mol. Mass.:63071.19
Organism:Homo sapiens (Human)
Description:O00519
Residue:579
BDBM26740
NameBDBM26740
Synonyms:N-phenyl-4-(quinolin-3-ylmethyl)piperidine-1-carboxamide | PF-750
TypeSmall organic molecule
Emp. Form.C22H23N3O
Mol. Mass.345.4375
SMILESO=C(Nc1ccccc1)N1CCC(Cc2cnc3ccccc3c2)CC1